{"text_format":"1","workbook":"xlsx","n_sheets":5,"sheets":["Справочники","Сотрудники на открытие счетов","Информация","dictionary_city","dictionary_branches_1"],"not_rendered":{"charts":0,"images":0,"macros":1,"external_links":1,"defined_names":11,"comments":0,"pivot_tables":0},"unopened":[],"bounds":{"document_bytes":16777216,"sheet_cells":100000,"rows_first":2000,"rows_last":500,"rows_between":2000,"halvings":0,"cell_chars":16384,"cell_head_chars":4096},"cells_cut":0,"cells_raw":0,"read":"whole","date_system":"1900"}

{"sheet":"Справочники","index":0,"n_rows":597,"n_cols":16,"rows_kept":597,"cut":false,"hidden":false,"merged":[[5,0,5,1],[14,0,14,1],[0,12,0,13],[0,14,0,15],[0,6,0,7],[0,9,0,10],[0,0,0,1],[0,3,0,4]]}
["Тип Документа (удостоверяющий личность)",null,null,"Код страны гражданства",null,null,"Код страны регистраци адреса",null,null,"Код региона (для адреса на территории РФ)",null,null,"Мнемоника "]
["Наименование","Код",null,"Наименование","Код",null,"Наименование","Код",null,"Наименование","Код",null,"Код","Наименование","Адрес","Город"]
["Иностранный паспорт","10",null,"АБХАЗИЯ(ГРУЗИЯ)","AB",null,"АБХАЗИЯ(ГРУЗИЯ)","AB",null,"РЕСПУБЛИКА АДЫГЕЯ","01",null,"0739","ДО \"Абакан-Черногорский парк\" в г.Абакан АО \"АЛЬФА-БАНК\"","655017, г. Абакан, ул. Щетинкина, д. 63","Абакан"]
[null,null,null,"АВСТРАЛИЯ","AU",null,"АВСТРАЛИЯ","AU",null,"РЕСПУБЛИКА БАШКОРТОСТАН","02",null,"1821","ДО \"Азов-Центральный\" в г. Азов АО\"АЛЬФА-БАНК\"","346787, г. Азов, ул. Мира, д. 45/64","Азов"]
[null,null,null,"АВСТРИЯ","AT",null,"АВСТРИЯ","AT",null,"РЕСПУБЛИКА БУРЯТИЯ","03",null,"1791","ДО \"Аксай-проспект Ленина\" в г. Аксай АО \"АЛЬФА-БАНК\"","346720, г. Аксай, пр-кт Ленина, д. 26","Аксай"]
["Код ДУП (для нерезидентов, Документ, Удостоверяющий право Пребывания)",null,null,"АЗЕРБАЙДЖАН","AZ",null,"АЗЕРБАЙДЖАН","AZ",null,"РЕСПУБЛИКА АЛТАЙ","04",null,"8107","ДО \"Александров-улица Ленина\" в г.Александров АО \"АЛЬФА-БАНК\"","601650, г. Александров, ул. Ленина, д. 22","Александров"]
["Название документа","Код",null,"АЛБАНИЯ","AL",null,"АЛБАНИЯ","AL",null,"РЕСПУБЛИКА ДАГЕСТАН","05",null,"8078","ДО \"Алексеевка-улица Мостовая\" в г.Алексеевка АО \"АЛЬФА-БАНК\"","309857, г. Алексеевка, ул. Мостовая, зд. 90","Алексеевка"]
["Вид на жительство","01",null,"АЛЖИР","DZ",null,"АЛЖИР","DZ",null,"ИНГУШСКАЯ РЕСПУБЛИКА","06",null,"1666","ДО \"Алексин-улица Мира\" в г. Алексин АО \"АЛЬФА-БАНК\"","301361, г. Алексин, ул. Мира, 20","Алексин"]
["Разрешение на временное проживание","02",null,"АНГИЛЬЯ","AI",null,"АНГИЛЬЯ","AI",null,"КАБАРДИНО - БАЛКАРСКАЯ РЕСПУБЛИКА","07",null,"0953","ДО \"Альметьевск-улица Ленина\" в г.Альметьевск АО \"АЛЬФА-БАНК\"","423452, г. Альметьевск, ул. Ленина, 29","Альметьевск"]
["Виза","03",null,"АНГОЛА","AO",null,"АНГОЛА","AO",null,"РЕСПУБЛИКА КАЛМЫКИЯ","08",null,"1186","ДО \"Анапа-улица Крымская\" в г. Анапа АО \"АЛЬФА-БАНК\"","353440, г. Анапа, ул. Крымская, д. 172","Анапа"]
["Участник ЭПР","04",null,"АНДОРРА","AD",null,"АНДОРРА","AD",null,"КАРАЧАЕВО - ЧЕРКЕССКАЯ РЕСПУБЛИКА","09",null,"0886","ДО \"Ангарск-Ленинградский проспект\"в г. Ангарск АО \"АЛЬФА-БАНК\"","665824, г. Ангарск, квартал 212, д. 15","Ангарск"]
["Уведомление о прибытии","05",null,"АНТАРКТИДА","AQ",null,"АНТАРКТИДА","AQ",null,"РЕСПУБЛИКА КАРЕЛИЯ","10",null,"1656","ДО \"Анжеро-Судженск-ул. Ленина\" в г. Анжеро-Судженск АО \"АЛЬФА-БАНК\"","652470, г. Анжеро-Судженск, ул. Ленина, д. 22","Анжеро-Судженск"]
["Патент","14",null,"АНТИГУАИБАРБУДА","AG",null,"АНТИГУАИБАРБУДА","AG",null,"РЕСПУБЛИКА КОМИ","11",null,"1811","ДО \"Апатиты-улица Ленина\" в г. Апатиты АО \"АЛЬФА-БАНК\"","184209, г. Апатиты, ул. Ленина, д. 4","Апатиты"]
["Разрешение на работу","15",null,"АНТИЛЬСКИЕОСТРОВА","AN",null,"АНТИЛЬСКИЕОСТРОВА","AN",null,"РЕСПУБЛИКА МАРИЙ ЭЛ","12",null,"1817","ДО \"Арзамас-проспект Ленина\" в г. Арзамас АО \"АЛЬФА-БАНК\"","607228, г. Арзамас, пр-кт Ленина, д. 198","Арзамас"]
["Тип МК (для нерезидентов)",null,null,"АОМЫНЬ(МАКАО)","MO",null,"АОМЫНЬ(МАКАО)","MO",null,"РЕСПУБЛИКА МОРДОВИЯ","13",null,"1151","ДО \"Армавир-улица Ленина\" в г. Армавир АО \"АЛЬФА-БАНК\"","352900, г. Армавир, ул. Ленина, д. 101а","Армавир"]
["Наименование","Код",null,"АРГЕНТИНА","AR",null,"АРГЕНТИНА","AR",null,"РЕСПУБЛИКА САХА (ЯКУТИЯ)","14",null,"1812","ДО \"Арсеньев-улица Калининская\" в г. Арсеньев АО \"АЛЬФА-БАНК\"","692342, г. Арсеньев, ул. Калининская, д. 24","Арсеньев"]
["Миграционная карта","01",null,"АРМЕНИЯ","AM",null,"АРМЕНИЯ","AM",null,"РЕСПУБЛИКА СЕВЕРНАЯ ОСЕТИЯ","15",null,"8166","ДО \"Арск-площадь Советская\" в г. Арск АО \"АЛЬФА-БАНК\"","422000, г. Арск, пл. Советская, д. 23","Арск"]
[null,null,null,"АРУБА","AW",null,"АРУБА","AW",null,"РЕСПУБЛИКА ТАТАРСТАН (ТАТАРСТАН)","16",null,"1700","ДО \"Артем-улица Фрунзе\" в г. АртемАО \"АЛЬФА-БАНК\"","692760, г. Артем,ул. Фрунзе, д. 65","Артем"]
[null,null,null,"АФГАНИСТАН","AF",null,"АФГАНИСТАН","AF",null,"РЕСПУБЛИКА ТЫВА","17",null,"0876","ДО \"Архангельск-Воскресенский\" в г.Архангельск АО \"АЛЬФА-БАНК\"","163060, г. Архангельск, ул.Воскресенская, д. 108","Архангельск"]
[null,null,null,"БАГАМСКИЕОСТРОВА","BS",null,"БАГАМСКИЕОСТРОВА","BS",null,"УДМУРТСКАЯ РЕСПУБЛИКА","18",null,"1058","ДО \"Архангельск-Поморский\" в г. Архангельск АО \"АЛЬФА-БАНК\"","163000, г. Архангельск, ул. Воскресенская, д. 6","Архангельск"]
[null,null,null,"БАНГЛАДЕШ","BD",null,"БАНГЛАДЕШ","BD",null,"РЕСПУБЛИКА ХАКАСИЯ","19",null,"1617","ДО \"Асбест-проспект Ленина\" в г. Асбест АО \"АЛЬФА-БАНК\"","624272, г. Асбест, пр-кт имени В.И. Ленина, д. 15","Асбест"]
[null,null,null,"БАРБАДОС","BB",null,"БАРБАДОС","BB",null,"ЧЕЧЕНСКАЯ РЕСПУБЛИКА","20",null,"1534","ДО \"Астрахань-Каспийский\" в г. Астрахань АО \"АЛЬФА-БАНК\"","414000, г. Астрахань, ул. Кирова, д. 12/2","Астрахань"]
[null,null,null,"БАХРЕЙН","BH",null,"БАХРЕЙН","BH",null,"ЧУВАШСКАЯ РЕСПУБ. - ЧАВАШ РЕСПУБ.","21",null,"8158","ДО \"Астрахань-Вокзальная площадь\" вг. Астрахань АО \"АЛЬФА-БАНК\"","414040, г. Астрахань, пл. Вокзальная, стр. 20б","Астрахань"]
[null,null,null,"БЕЛИЗ","BZ",null,"БЕЛИЗ","BZ",null,"АЛТАЙСКИЙ КРАЙ","22",null,"0686","ДО \"Ачинск-Чулым\" в г. Ачинск АО \"АЛЬФА-БАНК\"","662153, г. Ачинск, ул. 28 квартал, д. 5,пом.30","Ачинск"]
[null,null,null,"БЕЛОРУССИЯ","BY",null,"БЕЛОРУССИЯ","BY",null,"КРАСНОДАРСКИЙ КРАЙ","23",null,"1539","ДО \"Балаково-улица Трнавская\" в г.Балаково АО \"АЛЬФА-БАНК\"","413860, г. Балаково, ул. Трнавская, д. 23","Балаково"]
[null,null,null,"БЕЛЬГИЯ","BE",null,"БЕЛЬГИЯ","BE",null,"КРАСНОЯРСКИЙ КРАЙ","24",null,"0620","ДО \"БАЛАШИХА\" в г. Балашиха АО \"АЛЬФА-БАНК\"","143912, г. Балашиха, ш. Энтузиастов, д.7/1","БАЛАШИХА"]
[null,null,null,"БЕНИН","BJ",null,"БЕНИН","BJ",null,"ПРИМОРСКИЙ КРАЙ","25",null,"1181","ДО \"БАЛАШИХА-ЖЕЛЕЗНОДОРОЖНЫЙ\" в г.Балашиха АО \"АЛЬФА-БАНК\"","143980, г. Балашиха, ул. Пролетарская, д. 2А","БАЛАШИХА"]
[null,null,null,"БЕРМУДСКИЕОСТРОВА(БРИТАНИЯ)","BM",null,"БЕРМУДСКИЕОСТРОВА(БРИТАНИЯ)","BM",null,"СТАВРОПОЛЬСКИЙ КРАЙ","26",null,"1608","ДО \"Балашов-улица Ленина\" в г. Балашов АО \"АЛЬФА-БАНК\"","412309, г. Балашов, ул. Ленина, д. 21Б","Балашов"]
[null,null,null,"БОЛГАРИЯ","BG",null,"БОЛГАРИЯ","BG",null,"ХАБАРОВСКИЙ КРАЙ","27",null,"0813","ДО \"Барнаул-Алтай\" в г. Барнаул АО\"АЛЬФА-БАНК\"","656049, г. Барнаул,пр-кт Красноармейский, д. 58 \"Б\"","Барнаул"]
[null,null,null,"БОЛИВИЯ","BO",null,"БОЛИВИЯ","BO",null,"АМУРСКАЯ ОБЛАСТЬ","28",null,"0859","ДО \"Барнаул-площадь Победы\" в г. Барнаул АО \"АЛЬФА-БАНК\"","656015, г. Барнаул, пр-т Социалистический, д. 130","Барнаул"]
[null,null,null,"БОСНИЯИГЕРЦЕГОВИНА","BA",null,"БОСНИЯИГЕРЦЕГОВИНА","BA",null,"АРХАНГЕЛЬСКАЯ ОБЛАСТЬ","29",null,"0896","ДО \"Барнаул-площадь Советов\" в г. Барнаул АО \"АЛЬФА-БАНК\"","656038, г. Барнаул, пр-т Ленина, д. 58","Барнаул"]
[null,null,null,"БОТСВАНА","BW",null,"БОТСВАНА","BW",null,"АСТРАХАНСКАЯ ОБЛАСТЬ","30",null,"1120","ДО \"Барнаул-Огни\" в г. Барнаул АО \"АЛЬФА-БАНК\"","656039, г. Барнаул,ул. Антона Петрова, д. 219 Б","Барнаул"]
[null,null,null,"БРАЗИЛИЯ","BR",null,"БРАЗИЛИЯ","BR",null,"БЕЛГОРОДСКАЯ ОБЛАСТЬ","31",null,"1155","ДО \"Барнаул-Лето\" в г. Барнаул АО \"АЛЬФА-БАНК\"","656057, г. Барнаул,тракт Павловский, д. 251А","Барнаул"]
[null,null,null,"БРИТАНСКАЯТЕР-ЯВИНДИЙСКОМОКЕАНЕ","IO",null,"БРИТАНСКАЯТЕР-ЯВИНДИЙСКОМОКЕАНЕ","IO",null,"БРЯНСКАЯ ОБЛАСТЬ","32",null,"1173","ДО \"Батайск-улица Энгельса\" в г. Батайск АО \"АЛЬФА-БАНК\"","346880, г. Батайск, ул. Энгельса, д. 182","Батайск"]
[null,null,null,"БРУНЕЙ","BN",null,"БРУНЕЙ","BN",null,"ВЛАДИМИРСКАЯ ОБЛАСТЬ","33",null,"0957","ДО \"Белгород-улица Попова\" в г. Белгород АО \"АЛЬФА-БАНК\"","308009, г. Белгород, ул. Попова, д. 12","Белгород"]
[null,null,null,"БУВЕ","BV",null,"БУВЕ","BV",null,"ВОЛГОГРАДСКАЯ ОБЛАСТЬ","34",null,"1061","ДО \"Белгород-проспект Ватутина\" в г. Белгород АО \"АЛЬФА-БАНК\"","308000, г. Белгород, пр-кт Ватутина, д. 9б","Белгород"]
[null,null,null,"БУРКИНА-ФАСО","BF",null,"БУРКИНА-ФАСО","BF",null,"ВОЛОГОДСКАЯ ОБЛАСТЬ","35",null,"1123","ДО \"Белгород-улица Щорса\" в г. Белгород АО \"АЛЬФА-БАНК\"","308027, г. Белгород, ул. Щорса, 8","Белгород"]
[null,null,null,"БУРУНДИ","BI",null,"БУРУНДИ","BI",null,"ВОРОНЕЖСКАЯ ОБЛАСТЬ","36",null,"8117","ДО \"Белгород-Рио\" в г. Белгород АО\"АЛЬФА-БАНК\"","308010, г. Белгород, пр-кт Б. Хмельницкого, д. 164","Белгород"]
[null,null,null,"БУТАН","BT",null,"БУТАН","BT",null,"ИВАНОВСКАЯ ОБЛАСТЬ","37",null,"1716","ДО \"Белебей-ул. Красная\" в г. Белебей АО \"АЛЬФА-БАНК\"","452005, г. Белебей, ул. Красная, д. 134","Белебей"]
[null,null,null,"ВАНУАТУ","VU",null,"ВАНУАТУ","VU",null,"ИРКУТСКАЯ ОБЛАСТЬ","38",null,"1734","ДО \"Белово-улица Юбилейная\" в г. Белово АО \"АЛЬФА-БАНК\"","652600, г. Белово, ул. Юбилейная, д. 8","Белово"]
{"$rows_left_out":558}
{"sheet":"Сотрудники на открытие счетов","index":1,"n_rows":105,"n_cols":41,"rows_kept":105,"cut":false,"hidden":false,"merged":[]}
["Фамилия","Имя","Отчество","Дата рождения","Место рождения","Пол","Тип документа","Серия документа","Номер документа","Кем выдан документ","Дата выдачи документа","Дата окончания документа","Мобильный телефон","Страна гражданства","Страна регистрации","Код ДУП","Серия и Номер ДУП","Дата начала действия ДУП","Дата окончания действия ДУП","Тип МК","Номер МК","Дата начала пребывания","Дата окончания пребывания","Адрес регистрации: Код страны","Адрес регистрации: Код региона","Адрес регистрации: Город","Адрес регистрации: Наименование улицы","Адрес регистрации: Номер дома","Адрес регистрации: Номер корпуса/строения","Адрес регистрации: Номер квартиры/комнаты","Фактический Адрес: Код страны","Фактический Адрес: Код региона","Фактический Адрес: Город","Фактический Адрес: Наименование улицы","Фактический Адрес: Номер дома","Фактический Адрес: Номер корпуса/строения","Фактический Адрес: Номер квартиры/комнаты","Город Отделения доставки карты при получении сотрудником карты в Банке","Отделение доставки карт","Код отделения","Табельный номер"]
[null,null,null,null,null,null,null,null,null,null,null,null,null,null,null,null,null,null,null,null,null,null,null,null,null,null,null,null,null,null,null,null,null,null,null,null,null,null,null,{"$f":"IFERROR(VLOOKUP(AM2,dictionary_branches_1!B:D,2,0),\"\")","v":""}]
[null,null,null,null,null,null,null,null,null,null,null,null,null,null,null,null,null,null,null,null,null,null,null,null,null,null,null,null,null,null,null,null,null,null,null,null,null,null,null,{"$f":"IFERROR(VLOOKUP(AM3,dictionary_branches_1!B:D,2,0),\"\")","v":""}]
[null,null,null,null,null,null,null,null,null,null,null,null,null,null,null,null,null,null,null,null,null,null,null,null,null,null,null,null,null,null,null,null,null,null,null,null,null,null,null,{"$f":"IFERROR(VLOOKUP(AM4,dictionary_branches_1!B:D,2,0),\"\")","v":""}]
[null,null,null,null,null,null,null,null,null,null,null,null,null,null,null,null,null,null,null,null,null,null,null,null,null,null,null,null,null,null,null,null,null,null,null,null,null,null,null,{"$f":"IFERROR(VLOOKUP(AM5,dictionary_branches_1!B:D,2,0),\"\")","v":""}]
[null,null,null,null,null,null,null,null,null,null,null,null,null,null,null,null,null,null,null,null,null,null,null,null,null,null,null,null,null,null,null,null,null,null,null,null,null,null,null,{"$f":"IFERROR(VLOOKUP(AM6,dictionary_branches_1!B:D,2,0),\"\")","v":""}]
[null,null,null,null,null,null,null,null,null,null,null,null,null,null,null,null,null,null,null,null,null,null,null,null,null,null,null,null,null,null,null,null,null,null,null,null,null,null,null,{"$f":"IFERROR(VLOOKUP(AM7,dictionary_branches_1!B:D,2,0),\"\")","v":""}]
[null,null,null,null,null,null,null,null,null,null,null,null,null,null,null,null,null,null,null,null,null,null,null,null,null,null,null,null,null,null,null,null,null,null,null,null,null,null,null,{"$f":"IFERROR(VLOOKUP(AM8,dictionary_branches_1!B:D,2,0),\"\")","v":""}]
[null,null,null,null,null,null,null,null,null,null,null,null,null,null,null,null,null,null,null,null,null,null,null,null,null,null,null,null,null,null,null,null,null,null,null,null,null,null,null,{"$f":"IFERROR(VLOOKUP(AM9,dictionary_branches_1!B:D,2,0),\"\")","v":""}]
[null,null,null,null,null,null,null,null,null,null,null,null,null,null,null,null,null,null,null,null,null,null,null,null,null,null,null,null,null,null,null,null,null,null,null,null,null,null,null,{"$f":"IFERROR(VLOOKUP(AM10,dictionary_branches_1!B:D,2,0),\"\")","v":""}]
[null,null,null,null,null,null,null,null,null,null,null,null,null,null,null,null,null,null,null,null,null,null,null,null,null,null,null,null,null,null,null,null,null,null,null,null,null,null,null,{"$f":"IFERROR(VLOOKUP(AM11,dictionary_branches_1!B:D,2,0),\"\")","v":""}]
[null,null,null,null,null,null,null,null,null,null,null,null,null,null,null,null,null,null,null,null,null,null,null,null,null,null,null,null,null,null,null,null,null,null,null,null,null,null,null,{"$f":"IFERROR(VLOOKUP(AM12,dictionary_branches_1!B:D,2,0),\"\")","v":""}]
[null,null,null,null,null,null,null,null,null,null,null,null,null,null,null,null,null,null,null,null,null,null,null,null,null,null,null,null,null,null,null,null,null,null,null,null,null,null,null,{"$f":"IFERROR(VLOOKUP(AM13,dictionary_branches_1!B:D,2,0),\"\")","v":""}]
[null,null,null,null,null,null,null,null,null,null,null,null,null,null,null,null,null,null,null,null,null,null,null,null,null,null,null,null,null,null,null,null,null,null,null,null,null,null,null,{"$f":"IFERROR(VLOOKUP(AM14,dictionary_branches_1!B:D,2,0),\"\")","v":""}]
[null,null,null,null,null,null,null,null,null,null,null,null,null,null,null,null,null,null,null,null,null,null,null,null,null,null,null,null,null,null,null,null,null,null,null,null,null,null,null,{"$f":"IFERROR(VLOOKUP(AM15,dictionary_branches_1!B:D,2,0),\"\")","v":""}]
[null,null,null,null,null,null,null,null,null,null,null,null,null,null,null,null,null,null,null,null,null,null,null,null,null,null,null,null,null,null,null,null,null,null,null,null,null,null,null,{"$f":"IFERROR(VLOOKUP(AM16,dictionary_branches_1!B:D,2,0),\"\")","v":""}]
[null,null,null,null,null,null,null,null,null,null,null,null,null,null,null,null,null,null,null,null,null,null,null,null,null,null,null,null,null,null,null,null,null,null,null,null,null,null,null,{"$f":"IFERROR(VLOOKUP(AM17,dictionary_branches_1!B:D,2,0),\"\")","v":""}]
[null,null,null,null,null,null,null,null,null,null,null,null,null,null,null,null,null,null,null,null,null,null,null,null,null,null,null,null,null,null,null,null,null,null,null,null,null,null,null,{"$f":"IFERROR(VLOOKUP(AM18,dictionary_branches_1!B:D,2,0),\"\")","v":""}]
[null,null,null,null,null,null,null,null,null,null,null,null,null,null,null,null,null,null,null,null,null,null,null,null,null,null,null,null,null,null,null,null,null,null,null,null,null,null,null,{"$f":"IFERROR(VLOOKUP(AM19,dictionary_branches_1!B:D,2,0),\"\")","v":""}]
[null,null,null,null,null,null,null,null,null,null,null,null,null,null,null,null,null,null,null,null,null,null,null,null,null,null,null,null,null,null,null,null,null,null,null,null,null,null,null,{"$f":"IFERROR(VLOOKUP(AM20,dictionary_branches_1!B:D,2,0),\"\")","v":""}]
[null,null,null,null,null,null,null,null,null,null,null,null,null,null,null,null,null,null,null,null,null,null,null,null,null,null,null,null,null,null,null,null,null,null,null,null,null,null,null,{"$f":"IFERROR(VLOOKUP(AM21,dictionary_branches_1!B:D,2,0),\"\")","v":""}]
[null,null,null,null,null,null,null,null,null,null,null,null,null,null,null,null,null,null,null,null,null,null,null,null,null,null,null,null,null,null,null,null,null,null,null,null,null,null,null,{"$f":"IFERROR(VLOOKUP(AM22,dictionary_branches_1!B:D,2,0),\"\")","v":""}]
[null,null,null,null,null,null,null,null,null,null,null,null,null,null,null,null,null,null,null,null,null,null,null,null,null,null,null,null,null,null,null,null,null,null,null,null,null,null,null,{"$f":"IFERROR(VLOOKUP(AM23,dictionary_branches_1!B:D,2,0),\"\")","v":""}]
[null,null,null,null,null,null,null,null,null,null,null,null,null,null,null,null,null,null,null,null,null,null,null,null,null,null,null,null,null,null,null,null,null,null,null,null,null,null,null,{"$f":"IFERROR(VLOOKUP(AM24,dictionary_branches_1!B:D,2,0),\"\")","v":""}]
[null,null,null,null,null,null,null,null,null,null,null,null,null,null,null,null,null,null,null,null,null,null,null,null,null,null,null,null,null,null,null,null,null,null,null,null,null,null,null,{"$f":"IFERROR(VLOOKUP(AM25,dictionary_branches_1!B:D,2,0),\"\")","v":""}]
[null,null,null,null,null,null,null,null,null,null,null,null,null,null,null,null,null,null,null,null,null,null,null,null,null,null,null,null,null,null,null,null,null,null,null,null,null,null,null,{"$f":"IFERROR(VLOOKUP(AM26,dictionary_branches_1!B:D,2,0),\"\")","v":""}]
[null,null,null,null,null,null,null,null,null,null,null,null,null,null,null,null,null,null,null,null,null,null,null,null,null,null,null,null,null,null,null,null,null,null,null,null,null,null,null,{"$f":"IFERROR(VLOOKUP(AM27,dictionary_branches_1!B:D,2,0),\"\")","v":""}]
[null,null,null,null,null,null,null,null,null,null,null,null,null,null,null,null,null,null,null,null,null,null,null,null,null,null,null,null,null,null,null,null,null,null,null,null,null,null,null,{"$f":"IFERROR(VLOOKUP(AM28,dictionary_branches_1!B:D,2,0),\"\")","v":""}]
[null,null,null,null,null,null,null,null,null,null,null,null,null,null,null,null,null,null,null,null,null,null,null,null,null,null,null,null,null,null,null,null,null,null,null,null,null,null,null,{"$f":"IFERROR(VLOOKUP(AM29,dictionary_branches_1!B:D,2,0),\"\")","v":""}]
[null,null,null,null,null,null,null,null,null,null,null,null,null,null,null,null,null,null,null,null,null,null,null,null,null,null,null,null,null,null,null,null,null,null,null,null,null,null,null,{"$f":"IFERROR(VLOOKUP(AM30,dictionary_branches_1!B:D,2,0),\"\")","v":""}]
[null,null,null,null,null,null,null,null,null,null,null,null,null,null,null,null,null,null,null,null,null,null,null,null,null,null,null,null,null,null,null,null,null,null,null,null,null,null,null,{"$f":"IFERROR(VLOOKUP(AM31,dictionary_branches_1!B:D,2,0),\"\")","v":""}]
[null,null,null,null,null,null,null,null,null,null,null,null,null,null,null,null,null,null,null,null,null,null,null,null,null,null,null,null,null,null,null,null,null,null,null,null,null,null,null,{"$f":"IFERROR(VLOOKUP(AM32,dictionary_branches_1!B:D,2,0),\"\")","v":""}]
[null,null,null,null,null,null,null,null,null,null,null,null,null,null,null,null,null,null,null,null,null,null,null,null,null,null,null,null,null,null,null,null,null,null,null,null,null,null,null,{"$f":"IFERROR(VLOOKUP(AM33,dictionary_branches_1!B:D,2,0),\"\")","v":""}]
[null,null,null,null,null,null,null,null,null,null,null,null,null,null,null,null,null,null,null,null,null,null,null,null,null,null,null,null,null,null,null,null,null,null,null,null,null,null,null,{"$f":"IFERROR(VLOOKUP(AM34,dictionary_branches_1!B:D,2,0),\"\")","v":""}]
[null,null,null,null,null,null,null,null,null,null,null,null,null,null,null,null,null,null,null,null,null,null,null,null,null,null,null,null,null,null,null,null,null,null,null,null,null,null,null,{"$f":"IFERROR(VLOOKUP(AM35,dictionary_branches_1!B:D,2,0),\"\")","v":""}]
[null,null,null,null,null,null,null,null,null,null,null,null,null,null,null,null,null,null,null,null,null,null,null,null,null,null,null,null,null,null,null,null,null,null,null,null,null,null,null,{"$f":"IFERROR(VLOOKUP(AM36,dictionary_branches_1!B:D,2,0),\"\")","v":""}]
[null,null,null,null,null,null,null,null,null,null,null,null,null,null,null,null,null,null,null,null,null,null,null,null,null,null,null,null,null,null,null,null,null,null,null,null,null,null,null,{"$f":"IFERROR(VLOOKUP(AM37,dictionary_branches_1!B:D,2,0),\"\")","v":""}]
[null,null,null,null,null,null,null,null,null,null,null,null,null,null,null,null,null,null,null,null,null,null,null,null,null,null,null,null,null,null,null,null,null,null,null,null,null,null,null,{"$f":"IFERROR(VLOOKUP(AM38,dictionary_branches_1!B:D,2,0),\"\")","v":""}]
[null,null,null,null,null,null,null,null,null,null,null,null,null,null,null,null,null,null,null,null,null,null,null,null,null,null,null,null,null,null,null,null,null,null,null,null,null,null,null,{"$f":"IFERROR(VLOOKUP(AM39,dictionary_branches_1!B:D,2,0),\"\")","v":""}]
[null,null,null,null,null,null,null,null,null,null,null,null,null,null,null,null,null,null,null,null,null,null,null,null,null,null,null,null,null,null,null,null,null,null,null,null,null,null,null,{"$f":"IFERROR(VLOOKUP(AM40,dictionary_branches_1!B:D,2,0),\"\")","v":""}]
{"$rows_left_out":66}
{"sheet":"Информация","index":2,"n_rows":3,"n_cols":1,"rows_kept":3,"cut":false,"hidden":false,"merged":[]}
["Наименование компании"]
["ИНН компании"]
["Зарплатный проект"]

{"sheet":"dictionary_city","index":3,"n_rows":325,"n_cols":1,"rows_kept":325,"cut":false,"hidden":true,"merged":[]}
["Наименование"]
["Москва"]
["Санкт-Петербург"]
["Абакан"]
["Азов"]
["Аксай"]
["Александров"]
["Алексеевка"]
["Алексин"]
["Альметьевск"]
["Анапа"]
["Ангарск"]
["Анжеро-Судженск"]
["Апатиты"]
["Арзамас"]
["Армавир"]
["Арсеньев"]
["Арск"]
["Артем"]
["Архангельск"]
["Асбест"]
["Астрахань"]
["Ачинск"]
["Балаково"]
["БАЛАШИХА"]
["Балашов"]
["Барнаул"]
["Батайск"]
["Белгород"]
["Белебей"]
["Белово"]
["Белогорск"]
["Белорецк"]
["Белореченск"]
["Бердск"]
["Березники"]
["Березовский"]
["Бийск"]
["Биробиджан"]
["Благовещенск"]
{"$rows_left_out":286}
{"sheet":"dictionary_branches_1","index":4,"n_rows":596,"n_cols":7,"rows_kept":596,"cut":false,"hidden":true,"merged":[]}
["Город","отделение","Код","Мнемоника",null,"Абакан","692342, г. Арсеньев, ул. Калининская, д. 24"]
["Абакан","655017, г. Абакан, ул. Щетинкина, д. 63","0739","MOJG",null,"Этот список должен быть осортирован"]
["Азов","346787, г. Азов, ул. Мира, д. 45/64","1821","MAC2"]
["Аксай","346720, г. Аксай, пр-кт Ленина, д. 26","1791","MAH8"]
["Александров","601650, г. Александров, ул. Ленина, д. 22","8107","MAL3"]
["Алексеевка","309857, г. Алексеевка, ул. Мостовая, зд. 90","8078","MAKZ"]
["Алексин","301361, г. Алексин, ул. Мира, 20","1666","MAEB"]
["Альметьевск","423452, г. Альметьевск, ул. Ленина, 29","0953","MOLM"]
["Анапа","353440, г. Анапа, ул. Крымская, д. 172","1186","MAAK"]
["Ангарск","665824, г. Ангарск, квартал 212, д. 15","0886","MOCB"]
["Анжеро-Судженск","652470, г. Анжеро-Судженск, ул. Ленина, д. 22","1656","MADY"]
["Апатиты","184209, г. Апатиты, ул. Ленина, д. 4","1811","MAB5"]
["Арзамас","607228, г. Арзамас, пр-кт Ленина, д. 198","1817","MACM"]
["Армавир","352900, г. Армавир, ул. Ленина, д. 101а","1151","MO80"]
["Арсеньев","692342, г. Арсеньев, ул. Калининская, д. 24","1812","MAB6"]
["Арск","422000, г. Арск, пл. Советская, д. 23","8166","MAOA"]
["Артем","692760, г. Артем,ул. Фрунзе, д. 65","1700","MAFC"]
["Архангельск","163060, г. Архангельск, ул.Воскресенская, д. 108","0876","MOBF"]
["Архангельск","163000, г. Архангельск, ул. Воскресенская, д. 6","1058","MOO5"]
["Асбест","624272, г. Асбест, пр-кт имени В.И. Ленина, д. 15","1617","MACA"]
["Астрахань","414000, г. Астрахань, ул. Кирова, д. 12/2","1534","MO7I"]
["Астрахань","414040, г. Астрахань, пл. Вокзальная, стр. 20б","8158","MAN2"]
["Ачинск","662153, г. Ачинск, ул. 28 квартал, д. 5,пом.30","0686","MOWJ"]
["Балаково","413860, г. Балаково, ул. Трнавская, д. 23","1539","MO8B"]
["БАЛАШИХА","143912, г. Балашиха, ш. Энтузиастов, д.7/1","0620","MOLJ"]
["БАЛАШИХА","143980, г. Балашиха, ул. Пролетарская, д. 2А","1181","MAAA"]
["Балашов","412309, г. Балашов, ул. Ленина, д. 21Б","1608","MABO"]
["Барнаул","656049, г. Барнаул,пр-кт Красноармейский, д. 58 \"Б\"","0813","MOJP"]
["Барнаул","656015, г. Барнаул, пр-т Социалистический, д. 130","0859","MOBD"]
["Барнаул","656038, г. Барнаул, пр-т Ленина, д. 58","0896","MOEQ"]
["Барнаул","656039, г. Барнаул,ул. Антона Петрова, д. 219 Б","1120","MO3X"]
["Барнаул","656057, г. Барнаул,тракт Павловский, д. 251А","1155","MO87"]
["Батайск","346880, г. Батайск, ул. Энгельса, д. 182","1173","MO8T"]
["Белгород","308009, г. Белгород, ул. Попова, д. 12","0957","MOEX"]
["Белгород","308000, г. Белгород, пр-кт Ватутина, д. 9б","1061","MOV0"]
["Белгород","308027, г. Белгород, ул. Щорса, 8","1123","MO61"]
["Белгород","308010, г. Белгород, пр-кт Б. Хмельницкого, д. 164","8117","MAMG"]
["Белебей","452005, г. Белебей, ул. Красная, д. 134","1716","MAFT"]
["Белово","652600, г. Белово, ул. Юбилейная, д. 8","1734","MAGG"]
["Белогорск","676805, г. Белогорск, ул. Кирова, д. 119","1744","MAGR"]
{"$rows_left_out":556}